Target
5-hydroxytryptamine receptor 6
Ligand
BDBM50308172
Substrate
Meas. Tech.
ChEMBL_610401 (CHEMBL1073457)
IC50
444±n/a nM
Citation
 Haydar, SNYun, HAndrae, PMMattes, JZhang, JKramer, ASmith, DLHuselton, CGraf, RAschmies, SSchechter, LEComery, TARobichaud, AJ 5-Cyclic amine-3-arylsulfonylindazoles as novel 5-HT6 receptor antagonists. J Med Chem 53:2521-7 (2010)  
Target
Name:
5-hydroxytryptamine receptor 6
Synonyms:
5-HT-6 5-hydroxytryptamine receptor 6 (5-HT-6) 5-hydroxytryptamine receptor 6 (5HT6) HTR6 Serotonin 6 (5-HT6) receptor | Serotonin Receptor 6
Type:
G Protein-Coupled Receptor (GPCR)
Mol. Mass.:
46968.43
Organism:
Homo sapiens (Human)
Description:
P50406
Residue:
440
  
Inhibitor
Name:
BDBM50308172
Synonyms:
(3R)-1-[2-Methyl-3-(naphthalen-1-ylsulfonyl)-2H-indazol-5-yl]pyrrolidin-3-amine | CHEMBL605971
Type:
Small organic molecule
Emp. Form.:
C22H22N4O2S
Mol. Mass.:
406.501
SMILES:
Cn1nc2ccc(cc2c1S(=O)(=O)c1cccc2ccccc12)N1CC[C@@H](N)C1
: