Target
Transient receptor potential cation channel subfamily V member 1
Ligand
BDBM20321
Substrate
Meas. Tech.
ChEMBL_607256 (CHEMBL1070096)
IC50
40±n/a nM
Citation
 Chang, MPark, SRKim, JJang, MPark, JHPark, JEPark, HGSuh, YGJeong, YSPark, YHKim, HD Silicon switch approach in TRPV1 antagonist MK-056 and its analogues. Bioorg Med Chem 18:111-6 (2010)  
Target
Name:
Transient receptor potential cation channel subfamily V member 1
Synonyms:
Capsaicin receptor TRPV1_RAT Trpv1 Vanilloid VR1 Vanilloid receptor 1 (VRI/TRPV1) Vanilloid receptor type 1-like (TrpV1/Vr1) Vr1l | osm-9-like TRP channel 1
Type:
Transient Receptor
Mol. Mass.:
94956.12
Organism:
Rattus norvegicus (rat)
Description:
O35433
Residue:
838
  
Inhibitor
Name:
BDBM20321
Synonyms:
3-[(4-tert-butylphenyl)methyl]-1-[(3-fluoro-4-methanesulfonamidophenyl)methyl]thiourea JYL1421 | thiourea analogue, 2
Type:
Small organic molecule
Emp. Form.:
C20H26FN3O2S2
Mol. Mass.:
423.568
SMILES:
CC(C)(C)c1ccc(CNC(=S)NCc2ccc(NS(C)(=O)=O)c(F)c2)cc1
: