Target
Prostaglandin E2 receptor EP3 subtype
Ligand
BDBM50308905
Substrate
Meas. Tech.
ChEMBL_611726 (CHEMBL1074320)
Ki
0.34±n/a nM
Citation
 Asada, MObitsu, TNagase, TTanaka, MYamaura, YTakizawa, HYoshikawa, KSato, KNarita, MOhuchida, SNakai, HToda, M 3-(2-Aminocarbonylphenyl)propanoic acid analogs as potent and selective EP3 receptor antagonists. Part 1: discovery and exploration of the carboxyamide side chain. Bioorg Med Chem 18:80-90 (2010)  
Target
Name:
Prostaglandin E2 receptor EP3 subtype
Synonyms:
PE2R3_MOUSE Prostaglandin E2 receptor EP3 isoform alpha Prostanoid EP3 receptor Ptgerep3
Type:
G-protein coupled receptor
Mol. Mass.:
40092.50
Organism:
Mus musculus (Mouse)
Description:
Residue:
365
  
Inhibitor
Name:
BDBM50308905
Synonyms:
3-[2-({[3-Methyl-1-(1-naphthyl)butyl]amino}carbonyl)-4-(phenoxymethyl)phenyl]propanoic acid | CHEMBL596903
Type:
Small organic molecule
Emp. Form.:
C32H33NO4
Mol. Mass.:
495.6087
SMILES:
CC(C)CC(NC(=O)c1cc(COc2ccccc2)ccc1CCC(O)=O)c1cccc2ccccc12
: