Target
B1 bradykinin receptor
Ligand
BDBM50309009
Substrate
Meas. Tech.
ChEMBL_612385 (CHEMBL1066271)
IC50
1.5±n/a nM
Citation
 Schaudt, MLocardi, EZischinsky, GStragies, RPfeifer, JRGibson, CScharn, DRichter, UKalkhof, HDinkel, KSchnatbaum, K Novel small molecule bradykinin B1 receptor antagonists. Part 1: benzamides and semicarbazides. Bioorg Med Chem Lett 20:1225-8 (2010)  
Target
Name:
B1 bradykinin receptor
Synonyms:
B1 BRADYKININ B1R BK-1 receptor BRADYB1 | Bradykinin B1 receptor
Type:
Enzyme
Mol. Mass.:
40508.87
Organism:
Homo sapiens (Human)
Description:
P46663
Residue:
353
  
Inhibitor
Name:
BDBM50309009
Synonyms:
(R)-N-(1-(5-(3,5-dichloro-2-(2,2-difluoroethoxy)phenyl)-3-fluoropyridin-2-yl)ethyl)-1-ethyl-2-(2,2,2-trifluoroacetyl)hydrazinecarboxamide | CHEMBL599779
Type:
Small organic molecule
Emp. Form.:
C20H18Cl2F6N4O3
Mol. Mass.:
547.278
SMILES:
CCN(NC(=O)C(F)(F)F)C(=O)N[C@H](C)c1ncc(cc1F)-c1cc(Cl)cc(Cl)c1OCC(F)F
: