Target
B1 bradykinin receptor
Ligand
BDBM50309023
Substrate
Meas. Tech.
ChEMBL_612393 (CHEMBL1066279)
IC50
1.7±n/a nM
Citation
 Zischinsky, GStragies, RSchaudt, MPfeifer, JRGibson, CLocardi, EScharn, DRichter, UKalkhof, HDinkel, KSchnatbaum, K Novel small molecule bradykinin B1 receptor antagonists. Part 2: 5-membered diaminoheterocycles. Bioorg Med Chem Lett 20:1229-32 (2010)  
Target
Name:
B1 bradykinin receptor
Synonyms:
B1 BRADYKININ B1R BK-1 receptor BRADYB1 | Bradykinin B1 receptor
Type:
Enzyme
Mol. Mass.:
40508.87
Organism:
Homo sapiens (Human)
Description:
P46663
Residue:
353
  
Inhibitor
Name:
BDBM50309023
Synonyms:
CHEMBL598147 | N-(2-((5'-chloro-3,3'-difluoro-2'-(5-methyl-1,2,4-oxadiazol-3-yl)biphenyl-4-yl)methylamino)-1H-imidazol-1-yl)-3-methoxyisoxazole-5-carboxamide
Type:
Small organic molecule
Emp. Form.:
C24H18ClF2N7O4
Mol. Mass.:
541.894
SMILES:
COc1cc(on1)C(=O)Nn1ccnc1NCc1ccc(cc1F)-c1cc(Cl)cc(F)c1-c1noc(C)n1
: