Target
Adenosine receptor A3
Ligand
BDBM35804
Substrate
Meas. Tech.
ChEMBL_609499 (CHEMBL1071771)
EC50
613±n/a nM
Citation
 Beattie, DBrearley, ABrown, ZCharlton, SJCox, BFairhurst, RAFozard, JRGedeck, PKirkham, PMeja, KNanson, LNeef, JOakman, HSpooner, GTaylor, RJTurner, RJWest, RWoodward, H Synthesis and evaluation of two series of 4'-aza-carbocyclic nucleosides as adenosine A2A receptor agonists. Bioorg Med Chem Lett 20:1219-24 (2010)  
Target
Name:
Adenosine receptor A3
Synonyms:
A3 adenosine receptor (hA3) ADORA3 | Adenosine A3 receptor (A3AR)
Type:
G Protein-Coupled Receptor (GPCR)
Mol. Mass.:
36197.32
Organism:
Homo sapiens (Human)
Description:
P0DMS8
Residue:
318
  
Inhibitor
Name:
BDBM35804
Synonyms:
(CGS21680) 3-(4-{2-[6-Amino-9-(5-ethylcarbamoylmethyl-3,4-dihydroxy-tetrahydro-furan-2-yl)-9H-purin-2-ylamino]-ethyl}-phenyl)-propionic acid 2-[4-(2-carboxyethyl)phenethylamino]-5''''-N-ethylcarboxamidoadenosine 3-(4-(2-(6-amino-9-((2R,3R,4S,5S)-5-(ethylcarbamoyl)-3,4-dihydroxy-tetrahydrofuran-2-yl)-9H-purin-2-ylamino)ethyl)phenyl)propanoic acid 3-(4-{2-[6-Amino-9-((2R,3R,4S,5S)-5-ethylcarbamoyl-3,4-dihydroxy-tetrahydro-furan-2-yl)-9H-purin-2-ylamino]-ethyl}-phenyl)-propionic acid CGS-21680 [3H]-CGS 21680
Type:
radiolabeled ligand
Emp. Form.:
C23H29N7O6
Mol. Mass.:
499.5197
SMILES:
CCNC(=O)[C@H]1O[C@H]([C@H](O)[C@@H]1O)n1cnc2c(N)nc(NCCc3ccc(CCC(O)=O)cc3)nc12
: