Target
Vascular endothelial growth factor receptor 1
Ligand
BDBM50309547
Substrate
Meas. Tech.
ChEMBL_609786 (CHEMBL1070753)
IC50
69±n/a nM
Citation
 Ilovich, OBillauer, HDotan, SMishani, E Labeled 3-aryl-4-indolylmaleimide derivatives and their potential as angiogenic PET biomarkers. Bioorg Med Chem 18:612-20 (2010)  
Target
Name:
Vascular endothelial growth factor receptor 1
Synonyms:
FLT FRT Fms-like tyrosine kinase 1 Tyrosine-protein kinase FRT VEGFR-1 VGFR1_HUMAN Vascular endothelial growth factor receptor 1 (FLT1) Vascular endothelial growth factor receptor 1 and 2 (Flt-1 and KDR) Vascular permeability factor receptor vascular endothelial growth factor/vascular permeability factor receptor
Type:
Receptor Tyrosine Kinase
Mol. Mass.:
150800.23
Organism:
Homo sapiens (Human)
Description:
P17948
Residue:
1338
  
Inhibitor
Name:
BDBM50309547
Synonyms:
3-(5-Iodo-1H-indol-3-yl)-4-(3,4,5-trimethoxyphenyl)-1H-pyrrole-2,5-dione | CHEMBL597492
Type:
Small organic molecule
Emp. Form.:
C21H17IN2O5
Mol. Mass.:
504.2746
SMILES:
COc1cc(cc(OC)c1OC)C1=C(C(=O)NC1=O)c1c[nH]c2ccc(I)cc12
: