Target
Mast/stem cell growth factor receptor Kit
Ligand
BDBM50309547
Substrate
Meas. Tech.
ChEMBL_609782 (CHEMBL1070749)
IC50
3330±n/a nM
Citation
 Ilovich, OBillauer, HDotan, SMishani, E Labeled 3-aryl-4-indolylmaleimide derivatives and their potential as angiogenic PET biomarkers. Bioorg Med Chem 18:612-20 (2010)  
Target
Name:
Mast/stem cell growth factor receptor Kit
Synonyms:
CD117 antigen KIT Mast/stem cell growth factor receptor Kit (cKIT) Proto-oncogene tyrosine-protein kinase Kit Stem cell growth factor receptor Tyrosine-protein kinase Kit c-kit v-kit Hardy-Zuckerman 4 feline sarcoma viral oncogene homolog
Type:
Protein
Mol. Mass.:
109869.37
Organism:
Homo sapiens (Human)
Description:
P10721
Residue:
976
  
Inhibitor
Name:
BDBM50309547
Synonyms:
3-(5-Iodo-1H-indol-3-yl)-4-(3,4,5-trimethoxyphenyl)-1H-pyrrole-2,5-dione | CHEMBL597492
Type:
Small organic molecule
Emp. Form.:
C21H17IN2O5
Mol. Mass.:
504.2746
SMILES:
COc1cc(cc(OC)c1OC)C1=C(C(=O)NC1=O)c1c[nH]c2ccc(I)cc12
: