Target
Epidermal growth factor receptor
Ligand
BDBM50309549
Substrate
Meas. Tech.
ChEMBL_609779 (CHEMBL1070746)
IC50
>8480±n/a nM
Citation
 Ilovich, OBillauer, HDotan, SMishani, E Labeled 3-aryl-4-indolylmaleimide derivatives and their potential as angiogenic PET biomarkers. Bioorg Med Chem 18:612-20 (2010)  
Target
Name:
Epidermal growth factor receptor
Synonyms:
EGF Receptor Substrate EGFR_HUMAN ERBB1 Epidermal Growth Factor Receptor erbB-1 Epidermal growth factor receptor (EGFR) HER1 Proto-oncogene c-ErbB-1 Tyrosine-Protein Kinase ErbB-1
Type:
Receptor Kinase Domain
Mol. Mass.:
134279.59
Organism:
Homo sapiens (Human)
Description:
P00533
Residue:
1210
  
Inhibitor
Name:
BDBM50309549
Synonyms:
3-(5-Fluoro-1H-indol-3-yl)-4-(3,4,5-trimethoxyphenyl)-1H-pyrrole-2,5-dione US9364459, O
Type:
Small organic molecule
Emp. Form.:
C21H17FN2O5
Mol. Mass.:
396.3685
SMILES:
COc1cc(cc(OC)c1OC)C1=C(C(=O)NC1=O)c1c[nH]c2ccc(F)cc12
: