Target
Fatty-acid amide hydrolase 1
Ligand
BDBM50309703
Substrate
Meas. Tech.
ChEMBL_610820 (CHEMBL1068137)
IC50
0.45±n/a nM
Citation
 Sit, SYConway, CMXie, KBertekap, RBourin, CBurris, KD Oxime carbamate--discovery of a series of novel FAAH inhibitors. Bioorg Med Chem Lett 20:1272-7 (2010)  
Target
Name:
Fatty-acid amide hydrolase 1
Synonyms:
Anandamide amidohydrolase FAAH FAAH1_HUMAN Fatty-acid amide hydrolase (FAAH) Oleamide hydrolase 1
Type:
Protein
Mol. Mass.:
63071.19
Organism:
Homo sapiens (Human)
Description:
O00519
Residue:
579
  
Inhibitor
Name:
BDBM50309703
Synonyms:
CHEMBL586217 | benzaldehyde O-4-(undecyloxy)phenylcarbamoyl oxime
Type:
Small organic molecule
Emp. Form.:
C25H34N2O3
Mol. Mass.:
410.5491
SMILES:
CCCCCCCCCCCOc1ccc(NC(=O)O\N=C\c2ccccc2)cc1
: