Target
Fatty-acid amide hydrolase 1
Ligand
BDBM50309704
Substrate
Meas. Tech.
ChEMBL_610820 (CHEMBL1068137)
IC50
2.4±n/a nM
Citation
 Sit, SYConway, CMXie, KBertekap, RBourin, CBurris, KD Oxime carbamate--discovery of a series of novel FAAH inhibitors. Bioorg Med Chem Lett 20:1272-7 (2010)  
Target
Name:
Fatty-acid amide hydrolase 1
Synonyms:
Anandamide amidohydrolase FAAH FAAH1_HUMAN Fatty-acid amide hydrolase (FAAH) Oleamide hydrolase 1
Type:
Protein
Mol. Mass.:
63071.19
Organism:
Homo sapiens (Human)
Description:
O00519
Residue:
579
  
Inhibitor
Name:
BDBM50309704
Synonyms:
CHEMBL596617 | benzaldehyde O-4-(dodecyloxy)phenylcarbamoyl oxime
Type:
Small organic molecule
Emp. Form.:
C26H36N2O3
Mol. Mass.:
424.5756
SMILES:
CCCCCCCCCCCCOc1ccc(NC(=O)O\N=C\c2ccccc2)cc1
: