Target
Fatty-acid amide hydrolase 1
Ligand
BDBM26758
Substrate
Meas. Tech.
ChEMBL_610820 (CHEMBL1068137)
IC50
1.7±n/a nM
Citation
 Sit, SYConway, CMXie, KBertekap, RBourin, CBurris, KD Oxime carbamate--discovery of a series of novel FAAH inhibitors. Bioorg Med Chem Lett 20:1272-7 (2010)  
Target
Name:
Fatty-acid amide hydrolase 1
Synonyms:
Anandamide amidohydrolase FAAH FAAH1_HUMAN Fatty-acid amide hydrolase (FAAH) Oleamide hydrolase 1
Type:
Protein
Mol. Mass.:
63071.19
Organism:
Homo sapiens (Human)
Description:
O00519
Residue:
579
  
Inhibitor
Name:
BDBM26758
Synonyms:
2-fluorophenyl N-[6-(2-methyl-4,5-diphenyl-1H-imidazol-1-yl)hexyl]carbamate | bisarylimidazole derivative, 17
Type:
Small organic molecule
Emp. Form.:
C29H30FN3O2
Mol. Mass.:
471.5658
SMILES:
Cc1nc(c(-c2ccccc2)n1CCCCCCNC(=O)Oc1ccccc1F)-c1ccccc1
: