Target
Fatty-acid amide hydrolase 1
Ligand
BDBM50309733
Substrate
Meas. Tech.
ChEMBL_610820 (CHEMBL1068137)
IC50
8.6±n/a nM
Citation
 Sit, SYConway, CMXie, KBertekap, RBourin, CBurris, KD Oxime carbamate--discovery of a series of novel FAAH inhibitors. Bioorg Med Chem Lett 20:1272-7 (2010)  
Target
Name:
Fatty-acid amide hydrolase 1
Synonyms:
Anandamide amidohydrolase FAAH FAAH1_HUMAN Fatty-acid amide hydrolase (FAAH) Oleamide hydrolase 1
Type:
Protein
Mol. Mass.:
63071.19
Organism:
Homo sapiens (Human)
Description:
O00519
Residue:
579
  
Inhibitor
Name:
BDBM50309733
Synonyms:
CHEMBL599381 | phenyl 4-(heptyloxy)phenylcarbamate
Type:
Small organic molecule
Emp. Form.:
C20H25NO3
Mol. Mass.:
327.4174
SMILES:
CCCCCCCOc1ccc(NC(=O)Oc2ccccc2)cc1
: