Target
Neuronal acetylcholine receptor subunit alpha-7
Ligand
BDBM50309888
Substrate
Meas. Tech.
ChEMBL_611542 (CHEMBL1066386)
Ki
3.19±n/a nM
Citation
 O'Donnell, CJRogers, BNBronk, BSBryce, DKCoe, JWCook, KKDuplantier, AJEvrard, EHajós, MHoffmann, WEHurst, RSMaklad, NMather, RJMcLean, SNedza, FMO'Neill, BTPeng, LQian, WRottas, MMSands, SBSchmidt, AWShrikhande, AVSpracklin, DKWong, DFZhang, AZhang, L Discovery of 4-(5-methyloxazolo[4,5-b]pyridin-2-yl)-1,4-diazabicyclo[3.2.2]nonane (CP-810,123), a novel alpha 7 nicotinic acetylcholine receptor agonist for the treatment of cognitive disorders in schizophrenia: synthesis, SAR development, and in vivo efficacy in cognition models. J Med Chem 53:1222-37 (2010)  
Target
Name:
Neuronal acetylcholine receptor subunit alpha-7
Synonyms:
ACHA7_RAT Cholinergic, Nicotinic Alpha7 Chrna7 Neuronal acetylcholine receptor (alpha7 nAChR) Neuronal acetylcholine receptor subunit alpha-7 Neuronal acetylcholine receptor subunit alpha-7 (nAChR)
Type:
Enzyme
Mol. Mass.:
56502.44
Organism:
Rattus norvegicus (Rat)
Description:
Q05941
Residue:
502
  
Inhibitor
Name:
BDBM50309888
Synonyms:
4-(6-Chloro-5-methyloxazolo[4,5-b]pyridin-2-yl)-1,4-diazabicyclo-[3.2.2]nonane | CHEMBL603052
Type:
Small organic molecule
Emp. Form.:
C14H17ClN4O
Mol. Mass.:
292.764
SMILES:
Cc1nc2nc(oc2cc1Cl)N1CCN2CCC1CC2
: