Target
Plasminogen activator inhibitor 1
Ligand
BDBM50310309
Substrate
Meas. Tech.
ChEMBL_607975 (CHEMBL1072391)
IC50
284±n/a nM
Citation
 El-Ayache, NCLi, SHWarnock, MLawrence, DAEmal, CD Novel bis-arylsulfonamides and aryl sulfonimides as inactivators of plasminogen activator inhibitor-1 (PAI-1). Bioorg Med Chem Lett 20:966-70 (2010)  
Target
Name:
Plasminogen activator inhibitor 1
Synonyms:
Endothelial plasminogen activator inhibitor PAI-1 PAI1_HUMAN Plasminogen activator inhibitor 1 Plasminogen activator inhibitor-1 SERPINE1
Type:
Enzyme
Mol. Mass.:
45064.00
Organism:
Homo sapiens (Human)
Description:
P05121
Residue:
402
  
Inhibitor
Name:
BDBM50310309
Synonyms:
CHEMBL596879 | N-(3,4-dihydroxyphenylsulfonyl)-N-hexyl-3,4-dihydroxybenzenesulfonamide
Type:
Small organic molecule
Emp. Form.:
C18H23NO8S2
Mol. Mass.:
445.507
SMILES:
CCCCCCN(S(=O)(=O)c1ccc(O)c(O)c1)S(=O)(=O)c1ccc(O)c(O)c1
: