Target
GABA-A receptor; alpha-5/beta-3/gamma-2
Ligand
BDBM50311071
Substrate
Meas. Tech.
ChEMBL_619498 (CHEMBL1111355)
Ki
1.8±n/a nM
Citation
 Knust, HAchermann, GBallard, TBuettelmann, BGasser, RFischer, HHernandez, MCKnoflach, FKoblet, AStadler, HThomas, AWTrube, GWaldmeier, P The discovery and unique pharmacological profile of RO4938581 and RO4882224 as potent and selective GABAA alpha5 inverse agonists for the treatment of cognitive dysfunction. Bioorg Med Chem Lett 19:5940-4 (2009)  
Target
Name:
GABA-A receptor; alpha-5/beta-3/gamma-2
Synonyms:
GABA receptor alpha-5/beta-3/gamma-2 subunit | Gamma-aminobutyric acid receptor subunit alpha-5/beta-3/gamma-2
Type:
Mol. Mass.:
Description:
ASSAY_ID of ChEMBL is 2148177
Components:
This complex has 3 components.
Component 1
Name:
Gamma-aminobutyric acid receptor subunit gamma-2
Synonyms:
GABA(A) receptor subunit gamma-2 GBRG2_HUMAN
Type:
PROTEIN
Mol. Mass.:
54172.74
Organism:
Homo sapiens (Human)
Description:
EBI_217
Residue:
467
  
Component 2
Name:
Gamma-aminobutyric acid receptor subunit beta-3
Synonyms:
GABA A receptor alpha-4/beta-3/gamma-2 GABA-A receptor GBRB3_HUMAN | agonist GABA site
Type:
PROTEIN
Mol. Mass.:
54130.51
Organism:
Homo sapiens (Human)
Description:
ChEMBL_448071
Residue:
473
  
Component 3
Name:
Gamma-aminobutyric acid receptor subunit alpha-5
Synonyms:
GABA receptor alpha-5 subunit GABRA5 Gamma-aminobutyric acid receptor subunit alpha-5 (GABA(A)) | Gamma-aminobutyric acid receptor subunit alpha-5 (GABAA)
Type:
Enzyme
Mol. Mass.:
52160.59
Organism:
Homo sapiens (Human)
Description:
P31644
Residue:
462
  
Inhibitor
Name:
BDBM50311071
Synonyms:
3-(difluoromethoxy)-10-methyl-9H-benzo[f]imidazo[1,5-a][1,2,4]triazolo[1,5-d][1,4]diazepine | CHEMBL1078781
Type:
Small organic molecule
Emp. Form.:
C14H11F2N5O
Mol. Mass.:
303.2668
SMILES:
Cc1ncn-2c1Cn1ncnc1-c1cc(OC(F)F)ccc-21
: