Target
A disintegrin and metalloproteinase with thrombospondin motifs 5
Ligand
BDBM50311088
Substrate
Meas. Tech.
ChEMBL_619828 (CHEMBL1106705)
IC50
7.4±n/a nM
Citation
 Shiozaki, MImai, HMaeda, KMiura, TYasue, KSuma, AYokota, MOgoshi, YHaas, JFryer, AMLaird, ERLittmann, NMAndrews, SWJosey, JAMimura, TShinozaki, YYoshiuchi, HInaba, T Synthesis and SAR of 2-phenyl-1-sulfonylaminocyclopropane carboxylates as ADAMTS-5 (Aggrecanase-2) inhibitors. Bioorg Med Chem Lett 19:6213-7 (2009)  
Target
Name:
A disintegrin and metalloproteinase with thrombospondin motifs 5
Synonyms:
A disintegrin and metalloproteinase with thrombospondin motifs 5 (ADAMTS-5) ADAMTS5 ATS5_HUMAN Metalloproteinase with thrombospondin motifs 5 (ADAMTS-5)
Type:
Enzyme
Mol. Mass.:
101769.09
Organism:
Homo sapiens (Human)
Description:
Q9UNA0
Residue:
930
  
Inhibitor
Name:
BDBM50311088
Synonyms:
CHEMBL1078281 | cis-rac-1-(5-(4-chloro-1H-pyrazol-1-yl)thiophene-2-sulfonamido)-2-methyl-3-phenylcyclopropanecarboxylic acid
Type:
Small organic molecule
Emp. Form.:
C18H16ClN3O4S2
Mol. Mass.:
437.92
SMILES:
C[C@@H]1[C@H](c2ccccc2)[C@]1(NS(=O)(=O)c1ccc(s1)-n1cc(Cl)cn1)C(O)=O
: