Target
Protein kinase C theta type
Ligand
BDBM50311947
Substrate
Meas. Tech.
ChEMBL_619965 (CHEMBL1114007)
IC50
8.7±n/a nM
Citation
 Shim, JEid, CLee, JLiu, EChaudhary, DBoschelli, DH Synthesis and PKCtheta inhibitory activity of a series of 5-vinyl phenyl sulfonamide-3-pyridinecarbonitriles. Bioorg Med Chem Lett 19:6575-7 (2009)  
Target
Name:
Protein kinase C theta type
Synonyms:
KPCT_HUMAN PRKCT Protein kinase C theta type (PRKCQ) nPKC-theta
Type:
Serine/threonine-protein kinase
Mol. Mass.:
81878.04
Organism:
Homo sapiens (Human)
Description:
Full-length human PKC theta (Panvera Catalog No. P2996).
Residue:
706
  
Inhibitor
Name:
BDBM50311947
Synonyms:
4-(2-(5-cyano-4-(4-methyl-1H-indol-5-ylamino)pyridin-3-yl)vinyl)-N,N-diethylbenzenesulfonamide | CHEMBL1079903
Type:
Small organic molecule
Emp. Form.:
C27H27N5O2S
Mol. Mass.:
485.601
SMILES:
CCN(CC)S(=O)(=O)c1ccc(\C=C\c2cncc(C#N)c2Nc2ccc3[nH]ccc3c2C)cc1
: