Target
Protein kinase C theta type
Ligand
BDBM50311952
Substrate
Meas. Tech.
ChEMBL_619965 (CHEMBL1114007)
IC50
3±n/a nM
Citation
 Shim, JEid, CLee, JLiu, EChaudhary, DBoschelli, DH Synthesis and PKCtheta inhibitory activity of a series of 5-vinyl phenyl sulfonamide-3-pyridinecarbonitriles. Bioorg Med Chem Lett 19:6575-7 (2009)  
Target
Name:
Protein kinase C theta type
Synonyms:
KPCT_HUMAN PRKCT Protein kinase C theta type (PRKCQ) nPKC-theta
Type:
Serine/threonine-protein kinase
Mol. Mass.:
81878.04
Organism:
Homo sapiens (Human)
Description:
Full-length human PKC theta (Panvera Catalog No. P2996).
Residue:
706
  
Inhibitor
Name:
BDBM50311952
Synonyms:
4-(4-methyl-1H-indol-5-ylamino)-5-(3-(piperidin-1-ylsulfonyl)styryl)nicotinonitrile | CHEMBL1081359
Type:
Small organic molecule
Emp. Form.:
C28H27N5O2S
Mol. Mass.:
497.611
SMILES:
Cc1c(Nc2c(\C=C\c3cccc(c3)S(=O)(=O)N3CCCCC3)cncc2C#N)ccc2[nH]ccc12
: