Target
Protein kinase C theta type
Ligand
BDBM50311959
Substrate
Meas. Tech.
ChEMBL_619965 (CHEMBL1114007)
IC50
68±n/a nM
Citation
 Shim, JEid, CLee, JLiu, EChaudhary, DBoschelli, DH Synthesis and PKCtheta inhibitory activity of a series of 5-vinyl phenyl sulfonamide-3-pyridinecarbonitriles. Bioorg Med Chem Lett 19:6575-7 (2009)  
Target
Name:
Protein kinase C theta type
Synonyms:
KPCT_HUMAN PRKCT Protein kinase C theta type (PRKCQ) nPKC-theta
Type:
Serine/threonine-protein kinase
Mol. Mass.:
81878.04
Organism:
Homo sapiens (Human)
Description:
Full-length human PKC theta (Panvera Catalog No. P2996).
Residue:
706
  
Inhibitor
Name:
BDBM50311959
Synonyms:
6-methyl-4-(4-methyl-1H-indol-5-ylamino)-5-(4-(piperidin-1-ylsulfonyl)styryl)nicotinonitrile | CHEMBL1080114
Type:
Small organic molecule
Emp. Form.:
C29H29N5O2S
Mol. Mass.:
511.638
SMILES:
Cc1ncc(C#N)c(Nc2ccc3[nH]ccc3c2C)c1\C=C\c1ccc(cc1)S(=O)(=O)N1CCCCC1
: