Target
Protein kinase C theta type
Ligand
BDBM50311961
Substrate
Meas. Tech.
ChEMBL_619965 (CHEMBL1114007)
IC50
6.2±n/a nM
Citation
 Shim, JEid, CLee, JLiu, EChaudhary, DBoschelli, DH Synthesis and PKCtheta inhibitory activity of a series of 5-vinyl phenyl sulfonamide-3-pyridinecarbonitriles. Bioorg Med Chem Lett 19:6575-7 (2009)  
Target
Name:
Protein kinase C theta type
Synonyms:
KPCT_HUMAN PRKCT Protein kinase C theta type (PRKCQ) nPKC-theta
Type:
Serine/threonine-protein kinase
Mol. Mass.:
81878.04
Organism:
Homo sapiens (Human)
Description:
Full-length human PKC theta (Panvera Catalog No. P2996).
Residue:
706
  
Inhibitor
Name:
BDBM50311961
Synonyms:
4-(4-methyl-1H-indol-5-ylamino)-5-(3-((4-methylpiperazin-1-ylsulfonyl)methyl)styryl)nicotinonitrile | CHEMBL1081921
Type:
Small organic molecule
Emp. Form.:
C29H30N6O2S
Mol. Mass.:
526.653
SMILES:
CN1CCN(CC1)S(=O)(=O)Cc1cccc(\C=C\c2cncc(C#N)c2Nc2ccc3[nH]ccc3c2C)c1
: