Target
Protein kinase C delta type
Ligand
BDBM50311946
Substrate
Meas. Tech.
ChEMBL_619964 (CHEMBL1114006)
IC50
1300±n/a nM
Citation
 Shim, JEid, CLee, JLiu, EChaudhary, DBoschelli, DH Synthesis and PKCtheta inhibitory activity of a series of 5-vinyl phenyl sulfonamide-3-pyridinecarbonitriles. Bioorg Med Chem Lett 19:6575-7 (2009)  
Target
Name:
Protein kinase C delta type
Synonyms:
KPCD_HUMAN PKCD Protein Kinase C- delta nPKC-delta
Type:
Enzyme
Mol. Mass.:
77516.79
Organism:
Homo sapiens (Human)
Description:
The recombinant human PKC enzymes were produced using a baculovirus expression system in SF9 cells
Residue:
676
  
Inhibitor
Name:
BDBM50311946
Synonyms:
4-(2-(5-cyano-4-(4-methyl-1H-indol-5-ylamino)pyridin-3-yl)vinyl)-N,N-dimethylbenzenesulfonamide | CHEMBL1080802
Type:
Small organic molecule
Emp. Form.:
C25H23N5O2S
Mol. Mass.:
457.547
SMILES:
CN(C)S(=O)(=O)c1ccc(\C=C\c2cncc(C#N)c2Nc2ccc3[nH]ccc3c2C)cc1
: