Target
Protein kinase C delta type
Ligand
BDBM50302529
Substrate
Meas. Tech.
ChEMBL_619964 (CHEMBL1114006)
IC50
41±n/a nM
Citation
 Shim, JEid, CLee, JLiu, EChaudhary, DBoschelli, DH Synthesis and PKCtheta inhibitory activity of a series of 5-vinyl phenyl sulfonamide-3-pyridinecarbonitriles. Bioorg Med Chem Lett 19:6575-7 (2009)  
Target
Name:
Protein kinase C delta type
Synonyms:
KPCD_HUMAN PKCD Protein Kinase C- delta nPKC-delta
Type:
Enzyme
Mol. Mass.:
77516.79
Organism:
Homo sapiens (Human)
Description:
The recombinant human PKC enzymes were produced using a baculovirus expression system in SF9 cells
Residue:
676
  
Inhibitor
Name:
BDBM50302529
Synonyms:
4-(4-methyl-1H-indol-5-ylamino)-5-(4-(2-(4-methylpiperazin-1-yl)ethoxy)styryl)nicotinonitrile | CHEMBL568457
Type:
Small organic molecule
Emp. Form.:
C30H32N6O
Mol. Mass.:
492.6147
SMILES:
CN1CCN(CCOc2ccc(\C=C\c3cncc(C#N)c3Nc3ccc4[nH]ccc4c3C)cc2)CC1
: