Target
Mitogen-activated protein kinase kinase kinase kinase 2
Ligand
BDBM50311953
Substrate
Meas. Tech.
ChEMBL_619953 (CHEMBL1113995)
IC50
1300±n/a nM
Citation
 Shim, JEid, CLee, JLiu, EChaudhary, DBoschelli, DH Synthesis and PKCtheta inhibitory activity of a series of 5-vinyl phenyl sulfonamide-3-pyridinecarbonitriles. Bioorg Med Chem Lett 19:6575-7 (2009)  
Target
Name:
Mitogen-activated protein kinase kinase kinase kinase 2
Synonyms:
2.7.11.1 GC kinase Germinal center kinase MAP4K2 MEK kinase kinase 2 RAB8IP | Rab8-interacting protein
Type:
Mol. Mass.:
91551.35
Organism:
Homo sapiens (Human)
Description:
Residue:
820
  
Inhibitor
Name:
BDBM50311953
Synonyms:
4-(4-methyl-1H-indol-5-ylamino)-5-(3-(4-methylpiperazin-1-ylsulfonyl)styryl)nicotinonitrile | CHEMBL1080994
Type:
Small organic molecule
Emp. Form.:
C28H28N6O2S
Mol. Mass.:
512.626
SMILES:
CN1CCN(CC1)S(=O)(=O)c1cccc(\C=C\c2cncc(C#N)c2Nc2ccc3[nH]ccc3c2C)c1
: