Target
Prostaglandin D2 receptor 2
Ligand
BDBM50312915
Substrate
Meas. Tech.
ChEMBL_615898 (CHEMBL1102912)
IC50
0.085000±n/a nM
Citation
 Grimstrup, MReceveur, JMRist, ØFrimurer, TMNielsen, PAMathiesen, JMHögberg, T Exploration of SAR features by modifications of thiazoleacetic acids as CRTH2 antagonists. Bioorg Med Chem Lett 20:1638-41 (2010)  
Target
Name:
Prostaglandin D2 receptor 2
Synonyms:
CD_antigen=CD294 Chemoattractant Receptor-homologous molecule expressed on T-helper type 2 cells (CRTH2) Chemoattractant receptor-homologous molecule expressed on Th2 cells (CRTH2) G protein-coupled receptor 44 GPR44 PTGDR2 Prostaglandin D2 receptor 2 | Prostaglandin D2 receptor 2 (PGD2)
Type:
Enzyme
Mol. Mass.:
43295.45
Organism:
Homo sapiens (Human)
Description:
Q9Y5Y4
Residue:
395
  
Inhibitor
Name:
BDBM50312915
Synonyms:
2-(2-(1,1-diphenylethyl)-4-(4-fluorophenyl)thiazol-5-yl)acetic acid | CHEMBL1087622
Type:
Small organic molecule
Emp. Form.:
C25H20FNO2S
Mol. Mass.:
417.495
SMILES:
CC(c1nc(c(CC(O)=O)s1)-c1ccc(F)cc1)(c1ccccc1)c1ccccc1
: