Target
Cyclin-dependent kinase 1
Ligand
BDBM50312933
Substrate
Meas. Tech.
ChEMBL_616045 (CHEMBL1102008)
IC50
250±n/a nM
Citation
 Zeng, QAllen, JGBourbeau, MPWang, XYao, GTadesse, SRider, JTYuan, CCHong, FTLee, MRZhang, SLofgren, JAFreeman, DJYang, SLi, CTominey, EHuang, XHoffman, DYamane, HKFotsch, CDominguez, CHungate, RZhang, X Azole-based inhibitors of AKT/PKB for the treatment of cancer. Bioorg Med Chem Lett 20:1559-64 (2010)  
Target
Name:
Cyclin-dependent kinase 1
Synonyms:
CDC2 CDK1 CDKN1 Cell division protein kinase 1 P34CDC2 | p34 protein kinase
Type:
Enzyme Subunit
Mol. Mass.:
34101.08
Organism:
Homo sapiens (Human)
Description:
P06493
Residue:
297
  
Inhibitor
Name:
BDBM50312933
Synonyms:
(S)-5-(2-(2-amino-3-(4-(trifluoromethyl)phenyl)propylamino)thiazol-5-yl)indolin-2-one | CHEMBL1081831
Type:
Small organic molecule
Emp. Form.:
C21H19F3N4OS
Mol. Mass.:
432.462
SMILES:
N[C@H](CNc1ncc(s1)-c1ccc2NC(=O)Cc2c1)Cc1ccc(cc1)C(F)(F)F
: