Target
RAC-alpha serine/threonine-protein kinase
Ligand
BDBM50312940
Substrate
Meas. Tech.
ChEMBL_615907 (CHEMBL1102921)
IC50
95±n/a nM
Citation
 Zeng, QAllen, JGBourbeau, MPWang, XYao, GTadesse, SRider, JTYuan, CCHong, FTLee, MRZhang, SLofgren, JAFreeman, DJYang, SLi, CTominey, EHuang, XHoffman, DYamane, HKFotsch, CDominguez, CHungate, RZhang, X Azole-based inhibitors of AKT/PKB for the treatment of cancer. Bioorg Med Chem Lett 20:1559-64 (2010)  
Target
Name:
RAC-alpha serine/threonine-protein kinase
Synonyms:
AKT phosphorylation (p-AKT) AKT1/PPP1CA C-AKT PKB alpha Protein kinase B Protein kinase B (Akt 1) Protein kinase B alpha Proto-oncogene Akt (Akt1) Proto-oncogene c-Akt (AKT1) RAC-PK-alpha RAC-alpha serine/threonine-protein kinase (AKT1) | RAC-alpha serine/threonine-protein kinase (pAKT)
Type:
Enzyme
Mol. Mass.:
55681.25
Organism:
Homo sapiens (Human)
Description:
P31749
Residue:
480
  
Inhibitor
Name:
BDBM50312940
Synonyms:
(S)-5-(2-(2-amino-3-(4-(trifluoromethyl)phenyl)propylamino)thiazol-5-yl)isoindolin-1-one | CHEMBL1081029
Type:
Small organic molecule
Emp. Form.:
C21H19F3N4OS
Mol. Mass.:
432.462
SMILES:
N[C@H](CNc1ncc(s1)-c1ccc2C(=O)NCc2c1)Cc1ccc(cc1)C(F)(F)F
: