Target
RAC-alpha serine/threonine-protein kinase
Ligand
BDBM50312925
Substrate
Meas. Tech.
ChEMBL_615910 (CHEMBL1102924)
IC50
40±n/a nM
Citation
 Zeng, QAllen, JGBourbeau, MPWang, XYao, GTadesse, SRider, JTYuan, CCHong, FTLee, MRZhang, SLofgren, JAFreeman, DJYang, SLi, CTominey, EHuang, XHoffman, DYamane, HKFotsch, CDominguez, CHungate, RZhang, X Azole-based inhibitors of AKT/PKB for the treatment of cancer. Bioorg Med Chem Lett 20:1559-64 (2010)  
Target
Name:
RAC-alpha serine/threonine-protein kinase
Synonyms:
AKT phosphorylation (p-AKT) AKT1/PPP1CA C-AKT PKB alpha Protein kinase B Protein kinase B (Akt 1) Protein kinase B alpha Proto-oncogene Akt (Akt1) Proto-oncogene c-Akt (AKT1) RAC-PK-alpha RAC-alpha serine/threonine-protein kinase (AKT1) | RAC-alpha serine/threonine-protein kinase (pAKT)
Type:
Enzyme
Mol. Mass.:
55681.25
Organism:
Homo sapiens (Human)
Description:
P31749
Residue:
480
  
Inhibitor
Name:
BDBM50312925
Synonyms:
(R)-4-(3-(isoquinolin-6-yl)isoxazol-5-yl)-1-(4-(trifluoromethyl)phenyl)butan-2-amine | CHEMBL1081105
Type:
Small organic molecule
Emp. Form.:
C23H20F3N3O
Mol. Mass.:
411.4196
SMILES:
N[C@H](CCc1cc(no1)-c1ccc2cnccc2c1)Cc1ccc(cc1)C(F)(F)F
: