Target
RAC-alpha serine/threonine-protein kinase
Ligand
BDBM50312928
Substrate
Meas. Tech.
ChEMBL_615910 (CHEMBL1102924)
IC50
895±n/a nM
Citation
 Zeng, QAllen, JGBourbeau, MPWang, XYao, GTadesse, SRider, JTYuan, CCHong, FTLee, MRZhang, SLofgren, JAFreeman, DJYang, SLi, CTominey, EHuang, XHoffman, DYamane, HKFotsch, CDominguez, CHungate, RZhang, X Azole-based inhibitors of AKT/PKB for the treatment of cancer. Bioorg Med Chem Lett 20:1559-64 (2010)  
Target
Name:
RAC-alpha serine/threonine-protein kinase
Synonyms:
AKT phosphorylation (p-AKT) AKT1/PPP1CA C-AKT PKB alpha Protein kinase B Protein kinase B (Akt 1) Protein kinase B alpha Proto-oncogene Akt (Akt1) Proto-oncogene c-Akt (AKT1) RAC-PK-alpha RAC-alpha serine/threonine-protein kinase (AKT1) | RAC-alpha serine/threonine-protein kinase (pAKT)
Type:
Enzyme
Mol. Mass.:
55681.25
Organism:
Homo sapiens (Human)
Description:
P31749
Residue:
480
  
Inhibitor
Name:
BDBM50312928
Synonyms:
(S)-N1-(5-(1-methyl-1H-indazol-6-yl)thiazol-2-yl)-3-(4-(trifluoromethyl)phenyl)propane-1,2-diamine | CHEMBL1079626
Type:
Small organic molecule
Emp. Form.:
C21H20F3N5S
Mol. Mass.:
431.477
SMILES:
Cn1ncc2ccc(cc12)-c1cnc(NC[C@@H](N)Cc2ccc(cc2)C(F)(F)F)s1
: