Target
Cyclin-dependent kinase 2
Ligand
BDBM50312933
Substrate
Meas. Tech.
ChEMBL_615909 (CHEMBL1102923)
IC50
185±n/a nM
Citation
 Zeng, QAllen, JGBourbeau, MPWang, XYao, GTadesse, SRider, JTYuan, CCHong, FTLee, MRZhang, SLofgren, JAFreeman, DJYang, SLi, CTominey, EHuang, XHoffman, DYamane, HKFotsch, CDominguez, CHungate, RZhang, X Azole-based inhibitors of AKT/PKB for the treatment of cancer. Bioorg Med Chem Lett 20:1559-64 (2010)  
Target
Name:
Cyclin-dependent kinase 2
Synonyms:
CDK2 CDK2_HUMAN Cell division protein kinase 2 Protein cereblon/Cyclin-dependent kinase 2 | p33 protein kinase
Type:
Enzyme Subunit
Mol. Mass.:
33938.17
Organism:
Homo sapiens (Human)
Description:
P24941
Residue:
298
  
Inhibitor
Name:
BDBM50312933
Synonyms:
(S)-5-(2-(2-amino-3-(4-(trifluoromethyl)phenyl)propylamino)thiazol-5-yl)indolin-2-one | CHEMBL1081831
Type:
Small organic molecule
Emp. Form.:
C21H19F3N4OS
Mol. Mass.:
432.462
SMILES:
N[C@H](CNc1ncc(s1)-c1ccc2NC(=O)Cc2c1)Cc1ccc(cc1)C(F)(F)F
: