Target
Cyclin-dependent kinase 2
Ligand
BDBM50312935
Substrate
Meas. Tech.
ChEMBL_615909 (CHEMBL1102923)
IC50
285±n/a nM
Citation
 Zeng, QAllen, JGBourbeau, MPWang, XYao, GTadesse, SRider, JTYuan, CCHong, FTLee, MRZhang, SLofgren, JAFreeman, DJYang, SLi, CTominey, EHuang, XHoffman, DYamane, HKFotsch, CDominguez, CHungate, RZhang, X Azole-based inhibitors of AKT/PKB for the treatment of cancer. Bioorg Med Chem Lett 20:1559-64 (2010)  
Target
Name:
Cyclin-dependent kinase 2
Synonyms:
CDK2 CDK2_HUMAN Cell division protein kinase 2 Protein cereblon/Cyclin-dependent kinase 2 | p33 protein kinase
Type:
Enzyme Subunit
Mol. Mass.:
33938.17
Organism:
Homo sapiens (Human)
Description:
P24941
Residue:
298
  
Inhibitor
Name:
BDBM50312935
Synonyms:
(S)-6-(2-(2-amino-3-(4-(trifluoromethyl)phenyl)propylamino)thiazol-5-yl)benzo[d]thiazol-2(3H)-one | CHEMBL1081853
Type:
Small organic molecule
Emp. Form.:
C20H17F3N4OS2
Mol. Mass.:
450.5
SMILES:
N[C@H](CNc1ncc(s1)-c1ccc2[nH]c(=O)sc2c1)Cc1ccc(cc1)C(F)(F)F
: