Target
Cyclin-dependent kinase 2
Ligand
BDBM50312936
Substrate
Meas. Tech.
ChEMBL_615909 (CHEMBL1102923)
IC50
276±n/a nM
Citation
 Zeng, QAllen, JGBourbeau, MPWang, XYao, GTadesse, SRider, JTYuan, CCHong, FTLee, MRZhang, SLofgren, JAFreeman, DJYang, SLi, CTominey, EHuang, XHoffman, DYamane, HKFotsch, CDominguez, CHungate, RZhang, X Azole-based inhibitors of AKT/PKB for the treatment of cancer. Bioorg Med Chem Lett 20:1559-64 (2010)  
Target
Name:
Cyclin-dependent kinase 2
Synonyms:
CDK2 CDK2_HUMAN Cell division protein kinase 2 Protein cereblon/Cyclin-dependent kinase 2 | p33 protein kinase
Type:
Enzyme Subunit
Mol. Mass.:
33938.17
Organism:
Homo sapiens (Human)
Description:
P24941
Residue:
298
  
Inhibitor
Name:
BDBM50312936
Synonyms:
(S)-6-(2-(2-amino-3-(4-(trifluoromethyl)phenyl)propylamino)thiazol-5-yl)-1-methyl-1H-benzo[d]imidazol-2(3H)-one | CHEMBL1082016
Type:
Small organic molecule
Emp. Form.:
C21H20F3N5OS
Mol. Mass.:
447.477
SMILES:
Cn1c2cc(ccc2[nH]c1=O)-c1cnc(NC[C@@H](N)Cc2ccc(cc2)C(F)(F)F)s1
: