Target
RAC-alpha serine/threonine-protein kinase
Ligand
BDBM50312941
Substrate
Meas. Tech.
ChEMBL_615910 (CHEMBL1102924)
IC50
85±n/a nM
Citation
 Zeng, QAllen, JGBourbeau, MPWang, XYao, GTadesse, SRider, JTYuan, CCHong, FTLee, MRZhang, SLofgren, JAFreeman, DJYang, SLi, CTominey, EHuang, XHoffman, DYamane, HKFotsch, CDominguez, CHungate, RZhang, X Azole-based inhibitors of AKT/PKB for the treatment of cancer. Bioorg Med Chem Lett 20:1559-64 (2010)  
Target
Name:
RAC-alpha serine/threonine-protein kinase
Synonyms:
AKT phosphorylation (p-AKT) AKT1/PPP1CA C-AKT PKB alpha Protein kinase B Protein kinase B (Akt 1) Protein kinase B alpha Proto-oncogene Akt (Akt1) Proto-oncogene c-Akt (AKT1) RAC-PK-alpha RAC-alpha serine/threonine-protein kinase (AKT1) | RAC-alpha serine/threonine-protein kinase (pAKT)
Type:
Enzyme
Mol. Mass.:
55681.25
Organism:
Homo sapiens (Human)
Description:
P31749
Residue:
480
  
Inhibitor
Name:
BDBM50312941
Synonyms:
(S)-N1-(5-(isoquinolin-6-yl)-1,3,4-oxadiazol-2-yl)-3-(4-(trifluoromethyl)phenyl)propane-1,2-diamine | CHEMBL1081119
Type:
Small organic molecule
Emp. Form.:
C21H18F3N5O
Mol. Mass.:
413.3957
SMILES:
N[C@H](CNc1nnc(o1)-c1ccc2cnccc2c1)Cc1ccc(cc1)C(F)(F)F
: