Target
Cathepsin S
Ligand
BDBM50313469
Substrate
Meas. Tech.
ChEMBL_617378 (CHEMBL1101889)
IC50
93±n/a nM
Citation
 Rankovic, ZCai, JKerr, JFradera, XRobinson, JMistry, AHamilton, EMcGarry, GAndrews, FCaulfield, WCumming, IDempster, MWaller, JScullion, PMartin, IMitchell, ALong, CBaugh, MWestwood, PKinghorn, EBruin, JHamilton, WUitdehaag, Jvan Zeeland, MPotin, DSaniere, LFouquet, AChevallier, FDeronzier, HDorleans, CNicolai, E Design and optimization of a series of novel 2-cyano-pyrimidines as cathepsin K inhibitors. Bioorg Med Chem Lett 20:1524-7 (2010)  
Target
Name:
Cathepsin S
Synonyms:
CATS_HUMAN Cathepsin S (Cat S) | cathepsin S preproprotein
Type:
Protein
Mol. Mass.:
37507.38
Organism:
Homo sapiens (Human)
Description:
P25774
Residue:
331
  
Inhibitor
Name:
BDBM50313469
Synonyms:
4-(3-(methylsulfonyl)phenyl)-6-propylpyrimidine-2-carbonitrile | CHEMBL1082858
Type:
Small organic molecule
Emp. Form.:
C15H15N3O2S
Mol. Mass.:
301.364
SMILES:
CCCc1cc(nc(n1)C#N)-c1cccc(c1)S(C)(=O)=O
: