Target
Cathepsin S
Ligand
BDBM50313478
Substrate
Meas. Tech.
ChEMBL_617378 (CHEMBL1101889)
IC50
20±n/a nM
Citation
 Rankovic, ZCai, JKerr, JFradera, XRobinson, JMistry, AHamilton, EMcGarry, GAndrews, FCaulfield, WCumming, IDempster, MWaller, JScullion, PMartin, IMitchell, ALong, CBaugh, MWestwood, PKinghorn, EBruin, JHamilton, WUitdehaag, Jvan Zeeland, MPotin, DSaniere, LFouquet, AChevallier, FDeronzier, HDorleans, CNicolai, E Design and optimization of a series of novel 2-cyano-pyrimidines as cathepsin K inhibitors. Bioorg Med Chem Lett 20:1524-7 (2010)  
Target
Name:
Cathepsin S
Synonyms:
CATS_HUMAN Cathepsin S (Cat S) | cathepsin S preproprotein
Type:
Protein
Mol. Mass.:
37507.38
Organism:
Homo sapiens (Human)
Description:
P25774
Residue:
331
  
Inhibitor
Name:
BDBM50313478
Synonyms:
4-(3-(tert-butylamino)propyl)-6-(3-(trifluoromethyl)phenyl)pyrimidine-2-carbonitrile | CHEMBL1084402
Type:
Small organic molecule
Emp. Form.:
C19H21F3N4
Mol. Mass.:
362.392
SMILES:
CC(C)(C)NCCCc1cc(nc(n1)C#N)-c1cccc(c1)C(F)(F)F
: