Target
Cathepsin S
Ligand
BDBM50313479
Substrate
Meas. Tech.
ChEMBL_617378 (CHEMBL1101889)
IC50
>10000±n/a nM
Citation
 Rankovic, ZCai, JKerr, JFradera, XRobinson, JMistry, AHamilton, EMcGarry, GAndrews, FCaulfield, WCumming, IDempster, MWaller, JScullion, PMartin, IMitchell, ALong, CBaugh, MWestwood, PKinghorn, EBruin, JHamilton, WUitdehaag, Jvan Zeeland, MPotin, DSaniere, LFouquet, AChevallier, FDeronzier, HDorleans, CNicolai, E Design and optimization of a series of novel 2-cyano-pyrimidines as cathepsin K inhibitors. Bioorg Med Chem Lett 20:1524-7 (2010)  
Target
Name:
Cathepsin S
Synonyms:
CATS_HUMAN Cathepsin S (Cat S) | cathepsin S preproprotein
Type:
Protein
Mol. Mass.:
37507.38
Organism:
Homo sapiens (Human)
Description:
P25774
Residue:
331
  
Inhibitor
Name:
BDBM50313479
Synonyms:
4-cycloheptyl-6-(3-(piperidin-1-yl)propyl)pyrimidine-2-carbonitrile CHEMBL1084403
Type:
Small organic molecule
Emp. Form.:
C20H30N4
Mol. Mass.:
326.479
SMILES:
N#Cc1nc(CCCN2CCCCC2)cc(n1)C1CCCCCC1
: