Target
Procathepsin L
Ligand
BDBM50313478
Substrate
Meas. Tech.
ChEMBL_617379 (CHEMBL1101890)
IC50
9772±n/a nM
Citation
 Rankovic, ZCai, JKerr, JFradera, XRobinson, JMistry, AHamilton, EMcGarry, GAndrews, FCaulfield, WCumming, IDempster, MWaller, JScullion, PMartin, IMitchell, ALong, CBaugh, MWestwood, PKinghorn, EBruin, JHamilton, WUitdehaag, Jvan Zeeland, MPotin, DSaniere, LFouquet, AChevallier, FDeronzier, HDorleans, CNicolai, E Design and optimization of a series of novel 2-cyano-pyrimidines as cathepsin K inhibitors. Bioorg Med Chem Lett 20:1524-7 (2010)  
Target
Name:
Procathepsin L
Synonyms:
CATL1_HUMAN CTSL CTSL1 Cathepsin L Cathepsin L1 heavy chain MEP cathepsin L preproprotein
Type:
Enzyme
Mol. Mass.:
37557.19
Organism:
Homo sapiens (Human)
Description:
Purchased from Calbiochem (San Diego, CA).
Residue:
333
  
Inhibitor
Name:
BDBM50313478
Synonyms:
4-(3-(tert-butylamino)propyl)-6-(3-(trifluoromethyl)phenyl)pyrimidine-2-carbonitrile | CHEMBL1084402
Type:
Small organic molecule
Emp. Form.:
C19H21F3N4
Mol. Mass.:
362.392
SMILES:
CC(C)(C)NCCCc1cc(nc(n1)C#N)-c1cccc(c1)C(F)(F)F
: