Target
Procathepsin L
Ligand
BDBM50313480
Substrate
Meas. Tech.
ChEMBL_617379 (CHEMBL1101890)
IC50
1711±n/a nM
Citation
 Rankovic, ZCai, JKerr, JFradera, XRobinson, JMistry, AHamilton, EMcGarry, GAndrews, FCaulfield, WCumming, IDempster, MWaller, JScullion, PMartin, IMitchell, ALong, CBaugh, MWestwood, PKinghorn, EBruin, JHamilton, WUitdehaag, Jvan Zeeland, MPotin, DSaniere, LFouquet, AChevallier, FDeronzier, HDorleans, CNicolai, E Design and optimization of a series of novel 2-cyano-pyrimidines as cathepsin K inhibitors. Bioorg Med Chem Lett 20:1524-7 (2010)  
Target
Name:
Procathepsin L
Synonyms:
CATL1_HUMAN CTSL CTSL1 Cathepsin L Cathepsin L1 heavy chain MEP cathepsin L preproprotein
Type:
Enzyme
Mol. Mass.:
37557.19
Organism:
Homo sapiens (Human)
Description:
Purchased from Calbiochem (San Diego, CA).
Residue:
333
  
Inhibitor
Name:
BDBM50313480
Synonyms:
4-(cyclohexylamino)-6-(piperazin-1-yl)-1,3,5-triazine-2-carbonitrile CHEMBL1084679
Type:
Small organic molecule
Emp. Form.:
C14H21N7
Mol. Mass.:
287.3634
SMILES:
N#Cc1nc(NC2CCCCC2)nc(n1)N1CCNCC1
: