Target
Bombesin receptor subtype-3
Ligand
BDBM50313710
Substrate
Meas. Tech.
ChEMBL_614789 (CHEMBL1113308)
EC50
174.3±n/a nM
Citation
 He, SDobbelaar, PHLiu, JJian, TSebhat, IKLin, LSGoodman, AGuo, CGuzzo, PRHadden, MHenderson, AJRuenz, MSargent, BJYet, LKelly, TMPalyha, OKan, YPan, JChen, HMarsh, DJShearman, LPStrack, AMMetzger, JMFeighner, SDTan, CHoward, ADTamvakopoulos, CPeng, QGuan, XMReitman, MLPatchett, AAWyvratt, MJNargund, RP Discovery of substituted biphenyl imidazoles as potent, bioavailable bombesin receptor subtype-3 agonists. Bioorg Med Chem Lett 20:1913-7 (2010)  
Target
Name:
Bombesin receptor subtype-3
Synonyms:
BRS3_RAT Brs3
Type:
Enzyme Catalytic Domain
Mol. Mass.:
44213.49
Organism:
RAT
Description:
Bombesin 0 RAT::Q8K418
Residue:
399
  
Inhibitor
Name:
BDBM50313710
Synonyms:
4'-(2-(5-butyl-1H-imidazol-2-yl)-5-hydroxypentyl)biphenyl-2-carboxylic acid | CHEMBL1079517
Type:
Small organic molecule
Emp. Form.:
C25H30N2O3
Mol. Mass.:
406.5173
SMILES:
CCCCc1cnc([nH]1)C(CCCO)Cc1ccc(cc1)-c1ccccc1C(O)=O
: