Target
Cytochrome P450 3A4
Ligand
BDBM50220291
Substrate
Meas. Tech.
ChEMBL_626416 (CHEMBL1116196)
IC50
>2000±n/a nM
Citation
 Kreft, AFMartone, RPorte, A Recent advances in the identification of gamma-secretase inhibitors to clinically test the Abeta oligomer hypothesis of Alzheimer's disease. J Med Chem 52:6169-88 (2009)  
Target
Name:
Cytochrome P450 3A4
Synonyms:
Albendazole monooxygenase CP3A4_HUMAN CYP3A4 CYPIIIA4 Cytochrome P450 3A4 (CYP3A4) Nifedipine oxidase Taurochenodeoxycholate 6-alpha-hydroxylase
Type:
Enzyme
Mol. Mass.:
57349.57
Organism:
Homo sapiens (Human)
Description:
Residue:
503
  
Inhibitor
Name:
BDBM50220291
Synonyms:
1-((2R,6R)-1-(4-chlorophenylsulfonyl)-6-ethylpiperidin-2-yl)cyclopropyl 4-(1-hydroxy-2-methylpropan-2-yl)piperazine-1-carboxylate | CHEMBL236184
Type:
Small organic molecule
Emp. Form.:
C25H38ClN3O5S
Mol. Mass.:
528.104
SMILES:
CC[C@@H]1CCC[C@@H](N1S(=O)(=O)c1ccc(Cl)cc1)C1(CC1)OC(=O)N1CCN(CC1)C(C)(C)CO
: