Target
Orexin receptor type 2
Ligand
BDBM50314676
Substrate
Meas. Tech.
ChEMBL_625830 (CHEMBL1109766)
Ki
0.2±n/a nM
Citation
 Coleman, PJSchreier, JDMcGaughey, GBBogusky, MJCox, CDHartman, GDBall, RGHarrell, CMReiss, DRPrueksaritanont, TWinrow, CJRenger, JJ Design and synthesis of conformationally constrained N,N-disubstituted 1,4-diazepanes as potent orexin receptor antagonists. Bioorg Med Chem Lett 20:2311-5 (2010)  
Target
Name:
Orexin receptor type 2
Synonyms:
HCRTR2 OX2R_HUMAN Orexin receptor type 2 (OR-2) Orexin receptor type 2 (OX2R) Ox-2-R | Ox2-R
Type:
Protein
Mol. Mass.:
50710.53
Organism:
Homo sapiens (Human)
Description:
O43614
Residue:
444
  
Inhibitor
Name:
BDBM50314676
Synonyms:
(4-(6-fluoroquinazolin-2-yl)-1,4-diazepan-1-yl)(5-methyl-2-(2H-1,2,3-triazol-2-yl)phenyl)methanone | CHEMBL1089406
Type:
Small organic molecule
Emp. Form.:
C23H22FN7O
Mol. Mass.:
431.4655
SMILES:
Cc1ccc(c(c1)C(=O)N1CCCN(CC1)c1ncc2cc(F)ccc2n1)-n1nccn1
: