Target
Orexin/Hypocretin receptor type 1
Ligand
BDBM50258741
Substrate
Meas. Tech.
ChEMBL_625831 (CHEMBL1109767)
IC50
29±n/a nM
Citation
 Coleman, PJSchreier, JDMcGaughey, GBBogusky, MJCox, CDHartman, GDBall, RGHarrell, CMReiss, DRPrueksaritanont, TWinrow, CJRenger, JJ Design and synthesis of conformationally constrained N,N-disubstituted 1,4-diazepanes as potent orexin receptor antagonists. Bioorg Med Chem Lett 20:2311-5 (2010)  
Target
Name:
Orexin/Hypocretin receptor type 1
Synonyms:
HCRTR1 OX1R_HUMAN Orexin receptor type 1 (OR 1) Orexin receptor type 1 (OX1) Orexin receptor type 1 (OxR1) | Ox1r
Type:
Protein
Mol. Mass.:
47554.50
Organism:
Homo sapiens (Human)
Description:
O43613
Residue:
425
  
Inhibitor
Name:
BDBM50258741
Synonyms:
(5-methyl-2-(2H-1,2,3-triazol-2-yl)phenyl)(4-(quinazolin-2-yl)-1,4-diazepan-1-yl)methanone | CHEMBL469146
Type:
Small organic molecule
Emp. Form.:
C23H23N7O
Mol. Mass.:
413.475
SMILES:
Cc1ccc(c(c1)C(=O)N1CCCN(CC1)c1ncc2ccccc2n1)-n1nccn1
: