Target
Serine/threonine-protein kinase mTOR
Ligand
BDBM50315080
Substrate
Meas. Tech.
ChEMBL_624459 (CHEMBL1108787)
IC50
0.10±n/a nM
Citation
 Verheijen, JCRichard, DJCurran, KKaplan, JYu, KZask, A 2-Arylureidophenyl-4-(3-oxa-8-azabicyclo[3.2.1]octan-8-yl)triazines as highly potent and selective ATP competitive mTOR inhibitors: optimization of human microsomal stability. Bioorg Med Chem Lett 20:2648-53 (2010)  
Target
Name:
Serine/threonine-protein kinase mTOR
Synonyms:
FK506-binding protein 12-rapamycin complex-associated protein 1 FRAP FRAP1 MTOR Mammalian Target of Rapamycin (mTOR) RAFT1 Rapamycin and FKBP12 target 1 Serine/threonine-protein kinase (mTOR) | mTORC2
Type:
Rapamycin target protein
Mol. Mass.:
288917.12
Organism:
Homo sapiens (Human)
Description:
P42345
Residue:
2549
  
Inhibitor
Name:
BDBM50315080
Synonyms:
4-(3-(4-(4-(3-oxa-8-azabicyclo[3.2.1]octan-8-yl)-6-((R)-3-methylmorpholino)-1,3,5-triazin-2-yl)phenyl)ureido)-N-(2-(dimethylamino)ethyl)benzamide | CHEMBL1091714
Type:
Small organic molecule
Emp. Form.:
C32H41N9O4
Mol. Mass.:
615.7258
SMILES:
C[C@@H]1COCCN1c1nc(nc(n1)-c1ccc(NC(=O)Nc2ccc(cc2)C(=O)NCCN(C)C)cc1)N1C2CCC1COC2
: