Target
Adenosine receptor A3
Ligand
BDBM50315644
Substrate
Meas. Tech.
ChEMBL_623793 (CHEMBL1117076)
Ki
0.201±n/a nM
Citation
 Cheong, SLDolzhenko, AKachler, SPaoletta, SFederico, SCacciari, BDolzhenko, AKlotz, KNMoro, SSpalluto, GPastorin, G The significance of 2-furyl ring substitution with a 2-(para-substituted) aryl group in a new series of pyrazolo-triazolo-pyrimidines as potent and highly selective hA(3) adenosine receptors antagonists: new insights into structure-affinity relationship and receptor-antagonist recognition. J Med Chem 53:3361-75 (2010)  
Target
Name:
Adenosine receptor A3
Synonyms:
A3 adenosine receptor (hA3) ADORA3 | Adenosine A3 receptor (A3AR)
Type:
G Protein-Coupled Receptor (GPCR)
Mol. Mass.:
36197.32
Organism:
Homo sapiens (Human)
Description:
P0DMS8
Residue:
318
  
Inhibitor
Name:
BDBM50315644
Synonyms:
CHEMBL1091640 | N-[2-(4-Fluorophenyl)-8-methylpyrazolo[4,3-e][1,2,4]triazolo-[1,5-c]pyrimidin-5-yl]phenylacetamide
Type:
Small organic molecule
Emp. Form.:
C21H16FN7O
Mol. Mass.:
401.3964
SMILES:
Cn1cc2c(n1)nc(NC(=O)Cc1ccccc1)n1nc(nc21)-c1ccc(F)cc1
: