Target
Phospholipase A2, membrane associated
Ligand
BDBM23771
Substrate
Meas. Tech.
ChEMBL_630280 (CHEMBL1108228)
IC50
470±n/a nM
Citation
 Meddad-Belhabich, NAoun, DDjimdé, ARedeuilh, CDive, GMassicot, FChau, FHeymans, FLamouri, A Design of new potent and selective secretory phospholipase A(2) inhibitors. 6-Synthesis, structure-activity relationships and molecular modelling of 1-substituted-4-[4,5-dihydro-1,2,4-(4H)-oxadiazol-5-one-3-yl(methyl)]-functionalized aryl piperazin/one/dione derivatives. Bioorg Med Chem 18:3588-600 (2010)  
Target
Name:
Phospholipase A2, membrane associated
Synonyms:
GIIC sPLA2 NPS-PLA2 Non-pancreatic secretory phospholipase A2 (hnps-PLA2) PLA2B PLA2L Phospholipase A2 group IIA | RASF-A
Type:
Hydrolase
Mol. Mass.:
16101.20
Organism:
Homo sapiens (Human)
Description:
The human nps PLA2 was cloned, and expressed in E. coli. There was a refolding process in the purification.
Residue:
144
  
Inhibitor
Name:
BDBM23771
Synonyms:
(3-{[1-benzyl-3-(carbamoylmethyl)-2-ethyl-1H-indol-5-yl]oxy}propyl)phosphonic acid LY311727
Type:
Small organic molecule
Emp. Form.:
C22H27N2O5P
Mol. Mass.:
430.4339
SMILES:
CCc1c(CC(N)=O)c2cc(OCCCP(O)(O)=O)ccc2n1Cc1ccccc1
: