Target
Coagulation factor X
Ligand
BDBM50317092
Substrate
Meas. Tech.
ChEMBL_630625 (CHEMBL1111059)
IC50
11±n/a nM
Citation
 Fujimoto, TImaeda, YKonishi, NHiroe, KKawamura, MTextor, GPAertgeerts, KKubo, K Discovery of a tetrahydropyrimidin-2(1H)-one derivative (TAK-442) as a potent, selective, and orally active factor Xa inhibitor. J Med Chem 53:3517-31 (2010)  
Target
Name:
Coagulation factor X
Synonyms:
Activated coagulation factor X (FXa) Coagulation factor X precursor F10 Factor X heavy chain Factor Xa Stuart-Prower factor
Type:
Enzyme
Mol. Mass.:
54726.60
Organism:
Homo sapiens (Human)
Description:
Residue:
488
  
Inhibitor
Name:
BDBM50317092
Synonyms:
1-(1-{3-[(6-Chloronaphthalen-2-yl)sulfonyl]propanoyl}piperidin-4-yl)tetrahydropyrimidin-2(1H)-one | CHEMBL1095365
Type:
Small organic molecule
Emp. Form.:
C22H26ClN3O4S
Mol. Mass.:
463.978
SMILES:
Clc1ccc2cc(ccc2c1)S(=O)(=O)CCC(=O)N1CCC(CC1)N1CCCNC1=O
: