Target
Coagulation factor X
Ligand
BDBM50317095
Substrate
Meas. Tech.
ChEMBL_630625 (CHEMBL1111059)
IC50
9.1±n/a nM
Citation
 Fujimoto, TImaeda, YKonishi, NHiroe, KKawamura, MTextor, GPAertgeerts, KKubo, K Discovery of a tetrahydropyrimidin-2(1H)-one derivative (TAK-442) as a potent, selective, and orally active factor Xa inhibitor. J Med Chem 53:3517-31 (2010)  
Target
Name:
Coagulation factor X
Synonyms:
Activated coagulation factor X (FXa) Coagulation factor X precursor F10 Factor X heavy chain Factor Xa Stuart-Prower factor
Type:
Enzyme
Mol. Mass.:
54726.60
Organism:
Homo sapiens (Human)
Description:
Residue:
488
  
Inhibitor
Name:
BDBM50317095
Synonyms:
1'-{(2S)-3-[(6-Chloronaphthalen-2-yl)sulfonyl]-2-hydroxypropanoyl}-1,4'-bipiperidin-2-one | CHEMBL1096791
Type:
Small organic molecule
Emp. Form.:
C23H27ClN2O5S
Mol. Mass.:
478.989
SMILES:
O[C@H](CS(=O)(=O)c1ccc2cc(Cl)ccc2c1)C(=O)N1CCC(CC1)N1CCCCC1=O
: