Target
Coagulation factor X
Ligand
BDBM50317105
Substrate
Meas. Tech.
ChEMBL_630625 (CHEMBL1111059)
IC50
51±n/a nM
Citation
 Fujimoto, TImaeda, YKonishi, NHiroe, KKawamura, MTextor, GPAertgeerts, KKubo, K Discovery of a tetrahydropyrimidin-2(1H)-one derivative (TAK-442) as a potent, selective, and orally active factor Xa inhibitor. J Med Chem 53:3517-31 (2010)  
Target
Name:
Coagulation factor X
Synonyms:
Activated coagulation factor X (FXa) Coagulation factor X precursor F10 Factor X heavy chain Factor Xa Stuart-Prower factor
Type:
Enzyme
Mol. Mass.:
54726.60
Organism:
Homo sapiens (Human)
Description:
Residue:
488
  
Inhibitor
Name:
BDBM50317105
Synonyms:
(7aR)-2-(1-{(2S)-3-[(6-Chloronaphthalen-2-yl)sulfonyl]-2-hydroxypropanoyl}piperidin-4-yl)hexahydro-3H-pyrrolo[1,2-c]imidazol-3-one | CHEMBL1087088
Type:
Small organic molecule
Emp. Form.:
C24H28ClN3O5S
Mol. Mass.:
506.014
SMILES:
O[C@H](CS(=O)(=O)c1ccc2cc(Cl)ccc2c1)C(=O)N1CCC(CC1)N1C[C@H]2CCCN2C1=O
: