Target
Coagulation factor X
Ligand
BDBM50304620
Substrate
Meas. Tech.
ChEMBL_630625 (CHEMBL1111059)
IC50
8±n/a nM
Citation
 Fujimoto, TImaeda, YKonishi, NHiroe, KKawamura, MTextor, GPAertgeerts, KKubo, K Discovery of a tetrahydropyrimidin-2(1H)-one derivative (TAK-442) as a potent, selective, and orally active factor Xa inhibitor. J Med Chem 53:3517-31 (2010)  
Target
Name:
Coagulation factor X
Synonyms:
Activated coagulation factor X (FXa) Coagulation factor X precursor F10 Factor X heavy chain Factor Xa Stuart-Prower factor
Type:
Enzyme
Mol. Mass.:
54726.60
Organism:
Homo sapiens (Human)
Description:
Residue:
488
  
Inhibitor
Name:
BDBM50304620
Synonyms:
2-(1-(3-(6-chloronaphthalen-2-ylsulfonyl)propanoyl)piperidin-4-yl)-5-(hydroxymethyl)-1H-imidazo[1,5-c]imidazol-3(2H)-one CHEMBL593482
Type:
Small organic molecule
Emp. Form.:
C24H25ClN4O5S
Mol. Mass.:
516.997
SMILES:
OCc1ncc2CN(C3CCN(CC3)C(=O)CCS(=O)(=O)c3ccc4cc(Cl)ccc4c3)C(=O)n12
: