Target
Tissue-type plasminogen activator
Ligand
BDBM50317098
Substrate
Meas. Tech.
ChEMBL_630638 (CHEMBL1111072)
IC50
44000±n/a nM
Citation
 Fujimoto, TImaeda, YKonishi, NHiroe, KKawamura, MTextor, GPAertgeerts, KKubo, K Discovery of a tetrahydropyrimidin-2(1H)-one derivative (TAK-442) as a potent, selective, and orally active factor Xa inhibitor. J Med Chem 53:3517-31 (2010)  
Target
Name:
Tissue-type plasminogen activator
Synonyms:
Alteplase Reteplase Thrombin receptor protein Tissue-type plasminogen activator (tPA) t-PA t-plasminogen activator
Type:
Enzyme
Mol. Mass.:
62931.08
Organism:
Homo sapiens (Human)
Description:
Residue:
562
  
Inhibitor
Name:
BDBM50317098
Synonyms:
1-(1-{(2S)-3-[(6-chloronaphthalen-2-yl)sulfonyl]-2-hydroxypropanoyl}piperidin-4-yl)tetrahydropyrimidin-2(1H)-one TAK-442
Type:
Small organic molecule
Emp. Form.:
C22H26ClN3O5S
Mol. Mass.:
479.977
SMILES:
O[C@H](CS(=O)(=O)c1ccc2cc(Cl)ccc2c1)C(=O)N1CCC(CC1)N1CCCNC1=O
: